﻿Last name,Given names,Type,Notes,Depositor/applicant,Age,Date of arrival,Year,Page,QSA Ref,Item ID,Digital Image ID,Digital Image ID Source,Mfilm,Series ID,Index name,Description,Item ID Source
ADAMS,John,Depositor or Applicant,,,,1866/04/04,1866,10,A/13553,ITM272692,DR115625,https://www.archivessearch.qld.gov.au/api/download_file/DR115625,Z317,S7454,Register of Immigrants 1864-1878,Application details for passage certificates for immigration that were registered in Toowoomba; most immigrants in this register originate from Ireland,https://www.archivessearch.qld.gov.au/items/ITM272692
AHERN,Ellen,Immigrant,,AHERN Patrick,30,1877/11/28,1877,50,A/13553,ITM272692,DR115625,https://www.archivessearch.qld.gov.au/api/download_file/DR115625,Z317,S7454,Register of Immigrants 1864-1878,Application details for passage certificates for immigration that were registered in Toowoomba; most immigrants in this register originate from Ireland,https://www.archivessearch.qld.gov.au/items/ITM272692
AHERN,Patrick,Depositor or Applicant,,,,1877/11/28,1877,50,A/13553,ITM272692,DR115625,https://www.archivessearch.qld.gov.au/api/download_file/DR115625,Z317,S7454,Register of Immigrants 1864-1878,Application details for passage certificates for immigration that were registered in Toowoomba; most immigrants in this register originate from Ireland,https://www.archivessearch.qld.gov.au/items/ITM272692
ANTHONY,Jane,Immigrant,,ANTHONY Robert,,1875/12/04,1875,46,A/13553,ITM272692,DR115625,https://www.archivessearch.qld.gov.au/api/download_file/DR115625,Z317,S7454,Register of Immigrants 1864-1878,Application details for passage certificates for immigration that were registered in Toowoomba; most immigrants in this register originate from Ireland,https://www.archivessearch.qld.gov.au/items/ITM272692
ANTHONY,Robert,Depositor or Applicant,,,,1875/12/04,1875,46,A/13553,ITM272692,DR115625,https://www.archivessearch.qld.gov.au/api/download_file/DR115625,Z317,S7454,Register of Immigrants 1864-1878,Application details for passage certificates for immigration that were registered in Toowoomba; most immigrants in this register originate from Ireland,https://www.archivessearch.qld.gov.au/items/ITM272692
ANTHONY,Robert,Depositor or Applicant,,,,1875/12/29,1875,46,A/13553,ITM272692,DR115625,https://www.archivessearch.qld.gov.au/api/download_file/DR115625,Z317,S7454,Register of Immigrants 1864-1878,Application details for passage certificates for immigration that were registered in Toowoomba; most immigrants in this register originate from Ireland,https://www.archivessearch.qld.gov.au/items/ITM272692
ARNOLD,Henry,Depositor or Applicant,,,,1873/03/07,1873,28,A/13553,ITM272692,DR115625,https://www.archivessearch.qld.gov.au/api/download_file/DR115625,Z317,S7454,Register of Immigrants 1864-1878,Application details for passage certificates for immigration that were registered in Toowoomba; most immigrants in this register originate from Ireland,https://www.archivessearch.qld.gov.au/items/ITM272692
ATKINS,Rhoda,Immigrant,,JONES Sarah Ann,20,1873/10/13,1873,34,A/13553,ITM272692,DR115625,https://www.archivessearch.qld.gov.au/api/download_file/DR115625,Z317,S7454,Register of Immigrants 1864-1878,Application details for passage certificates for immigration that were registered in Toowoomba; most immigrants in this register originate from Ireland,https://www.archivessearch.qld.gov.au/items/ITM272692
ATTWELL,Alfred,Immigrant,,ATTWELL William,17,1875/05/05,1875,43,A/13553,ITM272692,DR115625,https://www.archivessearch.qld.gov.au/api/download_file/DR115625,Z317,S7454,Register of Immigrants 1864-1878,Application details for passage certificates for immigration that were registered in Toowoomba; most immigrants in this register originate from Ireland,https://www.archivessearch.qld.gov.au/items/ITM272692
ATTWELL,William,Depositor or Applicant,,,,1875/05/05,1875,43,A/13553,ITM272692,DR115625,https://www.archivessearch.qld.gov.au/api/download_file/DR115625,Z317,S7454,Register of Immigrants 1864-1878,Application details for passage certificates for immigration that were registered in Toowoomba; most immigrants in this register originate from Ireland,https://www.archivessearch.qld.gov.au/items/ITM272692
ATWELL,child,Immigrant,female child of Maria ATWELL,ATWELL William,8,1874/09/04,1874,40,A/13553,ITM272692,DR115625,https://www.archivessearch.qld.gov.au/api/download_file/DR115625,Z317,S7454,Register of Immigrants 1864-1878,Application details for passage certificates for immigration that were registered in Toowoomba; most immigrants in this register originate from Ireland,https://www.archivessearch.qld.gov.au/items/ITM272692
ATWELL,Fredk,Immigrant,,ATWELL William,15,1874/09/04,1874,40,A/13553,ITM272692,DR115625,https://www.archivessearch.qld.gov.au/api/download_file/DR115625,Z317,S7454,Register of Immigrants 1864-1878,Application details for passage certificates for immigration that were registered in Toowoomba; most immigrants in this register originate from Ireland,https://www.archivessearch.qld.gov.au/items/ITM272692
ATWELL,Henry,Immigrant,,ATWELL William,14,1874/09/04,1874,40,A/13553,ITM272692,DR115625,https://www.archivessearch.qld.gov.au/api/download_file/DR115625,Z317,S7454,Register of Immigrants 1864-1878,Application details for passage certificates for immigration that were registered in Toowoomba; most immigrants in this register originate from Ireland,https://www.archivessearch.qld.gov.au/items/ITM272692
ATWELL,Maria,Immigrant,,ATWELL William,18,1874/09/04,1874,40,A/13553,ITM272692,DR115625,https://www.archivessearch.qld.gov.au/api/download_file/DR115625,Z317,S7454,Register of Immigrants 1864-1878,Application details for passage certificates for immigration that were registered in Toowoomba; most immigrants in this register originate from Ireland,https://www.archivessearch.qld.gov.au/items/ITM272692
ATWELL,Maria,Immigrant,,ATWELL William,48,1874/09/04,1874,40,A/13553,ITM272692,DR115625,https://www.archivessearch.qld.gov.au/api/download_file/DR115625,Z317,S7454,Register of Immigrants 1864-1878,Application details for passage certificates for immigration that were registered in Toowoomba; most immigrants in this register originate from Ireland,https://www.archivessearch.qld.gov.au/items/ITM272692
ATWELL,William,Depositor or Applicant,,,,1874/09/04,1874,40,A/13553,ITM272692,DR115625,https://www.archivessearch.qld.gov.au/api/download_file/DR115625,Z317,S7454,Register of Immigrants 1864-1878,Application details for passage certificates for immigration that were registered in Toowoomba; most immigrants in this register originate from Ireland,https://www.archivessearch.qld.gov.au/items/ITM272692
ATWELL,William,Immigrant,,ATWELL William,11,1874/09/04,1874,40,A/13553,ITM272692,DR115625,https://www.archivessearch.qld.gov.au/api/download_file/DR115625,Z317,S7454,Register of Immigrants 1864-1878,Application details for passage certificates for immigration that were registered in Toowoomba; most immigrants in this register originate from Ireland,https://www.archivessearch.qld.gov.au/items/ITM272692
BAILEY,John,Immigrant,,BAILEY Thomas,22,1865/02/08,1865,6,A/13553,ITM272692,DR115625,https://www.archivessearch.qld.gov.au/api/download_file/DR115625,Z317,S7454,Register of Immigrants 1864-1878,Application details for passage certificates for immigration that were registered in Toowoomba; most immigrants in this register originate from Ireland,https://www.archivessearch.qld.gov.au/items/ITM272692
BAILEY,Thomas,Depositor or Applicant,,,,1865/02/08,1865,6,A/13553,ITM272692,DR115625,https://www.archivessearch.qld.gov.au/api/download_file/DR115625,Z317,S7454,Register of Immigrants 1864-1878,Application details for passage certificates for immigration that were registered in Toowoomba; most immigrants in this register originate from Ireland,https://www.archivessearch.qld.gov.au/items/ITM272692
BARCLAY,James,Depositor or Applicant,,,,1875/04/06,1875,43,A/13553,ITM272692,DR115625,https://www.archivessearch.qld.gov.au/api/download_file/DR115625,Z317,S7454,Register of Immigrants 1864-1878,Application details for passage certificates for immigration that were registered in Toowoomba; most immigrants in this register originate from Ireland,https://www.archivessearch.qld.gov.au/items/ITM272692
BARCLAY,Joseph,Immigrant,,BARCLAY James,22,1875/04/06,1875,43,A/13553,ITM272692,DR115625,https://www.archivessearch.qld.gov.au/api/download_file/DR115625,Z317,S7454,Register of Immigrants 1864-1878,Application details for passage certificates for immigration that were registered in Toowoomba; most immigrants in this register originate from Ireland,https://www.archivessearch.qld.gov.au/items/ITM272692
BARNARD,Ann,Depositor or Applicant,,,,1873/03/19,1873,28,A/13553,ITM272692,DR115625,https://www.archivessearch.qld.gov.au/api/download_file/DR115625,Z317,S7454,Register of Immigrants 1864-1878,Application details for passage certificates for immigration that were registered in Toowoomba; most immigrants in this register originate from Ireland,https://www.archivessearch.qld.gov.au/items/ITM272692
BARRETT,Cornelius,Immigrant,,COLLINS John,20,1865/09/30,1865,8,A/13553,ITM272692,DR115625,https://www.archivessearch.qld.gov.au/api/download_file/DR115625,Z317,S7454,Register of Immigrants 1864-1878,Application details for passage certificates for immigration that were registered in Toowoomba; most immigrants in this register originate from Ireland,https://www.archivessearch.qld.gov.au/items/ITM272692
BARRNE,J,Depositor or Applicant,,,,1867/10/08,1867,17,A/13553,ITM272692,DR115625,https://www.archivessearch.qld.gov.au/api/download_file/DR115625,Z317,S7454,Register of Immigrants 1864-1878,Application details for passage certificates for immigration that were registered in Toowoomba; most immigrants in this register originate from Ireland,https://www.archivessearch.qld.gov.au/items/ITM272692
BARRY,Bridget,Immigrant,,CRONIN William,20,1871/03/11,1871,24,A/13553,ITM272692,DR115625,https://www.archivessearch.qld.gov.au/api/download_file/DR115625,Z317,S7454,Register of Immigrants 1864-1878,Application details for passage certificates for immigration that were registered in Toowoomba; most immigrants in this register originate from Ireland,https://www.archivessearch.qld.gov.au/items/ITM272692
BARRY,Bridget,Immigrant,,CRONIN William,25,1873/03/07,1873,28,A/13553,ITM272692,DR115625,https://www.archivessearch.qld.gov.au/api/download_file/DR115625,Z317,S7454,Register of Immigrants 1864-1878,Application details for passage certificates for immigration that were registered in Toowoomba; most immigrants in this register originate from Ireland,https://www.archivessearch.qld.gov.au/items/ITM272692
BARRY,Bridget,Immigrant,,McGRATH Bridget,6,1878/11/25,1878,52,A/13553,ITM272692,DR115625,https://www.archivessearch.qld.gov.au/api/download_file/DR115625,Z317,S7454,Register of Immigrants 1864-1878,Application details for passage certificates for immigration that were registered in Toowoomba; most immigrants in this register originate from Ireland,https://www.archivessearch.qld.gov.au/items/ITM272692
BARRY,Margaret,Immigrant,,McGRATH Bridget,26,1878/11/25,1878,52,A/13553,ITM272692,DR115625,https://www.archivessearch.qld.gov.au/api/download_file/DR115625,Z317,S7454,Register of Immigrants 1864-1878,Application details for passage certificates for immigration that were registered in Toowoomba; most immigrants in this register originate from Ireland,https://www.archivessearch.qld.gov.au/items/ITM272692
BARRY,Mary,Immigrant,,BARRY Michael,17,1877/02/05,1877,49,A/13553,ITM272692,DR115625,https://www.archivessearch.qld.gov.au/api/download_file/DR115625,Z317,S7454,Register of Immigrants 1864-1878,Application details for passage certificates for immigration that were registered in Toowoomba; most immigrants in this register originate from Ireland,https://www.archivessearch.qld.gov.au/items/ITM272692
BARRY,Michael,Immigrant,,CRONIN William,22,1873/03/07,1873,28,A/13553,ITM272692,DR115625,https://www.archivessearch.qld.gov.au/api/download_file/DR115625,Z317,S7454,Register of Immigrants 1864-1878,Application details for passage certificates for immigration that were registered in Toowoomba; most immigrants in this register originate from Ireland,https://www.archivessearch.qld.gov.au/items/ITM272692
BARRY,Michael,Depositor or Applicant,,,,1875/09/28,1875,45,A/13553,ITM272692,DR115625,https://www.archivessearch.qld.gov.au/api/download_file/DR115625,Z317,S7454,Register of Immigrants 1864-1878,Application details for passage certificates for immigration that were registered in Toowoomba; most immigrants in this register originate from Ireland,https://www.archivessearch.qld.gov.au/items/ITM272692
BARRY,Michael,Immigrant,,,,1875/09/28,1875,45,A/13553,ITM272692,DR115625,https://www.archivessearch.qld.gov.au/api/download_file/DR115625,Z317,S7454,Register of Immigrants 1864-1878,Application details for passage certificates for immigration that were registered in Toowoomba; most immigrants in this register originate from Ireland,https://www.archivessearch.qld.gov.au/items/ITM272692
BARRY,Michael,Depositor or Applicant,,,,1877/02/05,1877,49,A/13553,ITM272692,DR115625,https://www.archivessearch.qld.gov.au/api/download_file/DR115625,Z317,S7454,Register of Immigrants 1864-1878,Application details for passage certificates for immigration that were registered in Toowoomba; most immigrants in this register originate from Ireland,https://www.archivessearch.qld.gov.au/items/ITM272692
BARRY,Thomas,Immigrant,,McGRATH Bridget,3,1878/11/25,1878,52,A/13553,ITM272692,DR115625,https://www.archivessearch.qld.gov.au/api/download_file/DR115625,Z317,S7454,Register of Immigrants 1864-1878,Application details for passage certificates for immigration that were registered in Toowoomba; most immigrants in this register originate from Ireland,https://www.archivessearch.qld.gov.au/items/ITM272692
BECK,Harrison,Depositor or Applicant,,,,1875/12/31,1875,46,A/13553,ITM272692,DR115625,https://www.archivessearch.qld.gov.au/api/download_file/DR115625,Z317,S7454,Register of Immigrants 1864-1878,Application details for passage certificates for immigration that were registered in Toowoomba; most immigrants in this register originate from Ireland,https://www.archivessearch.qld.gov.au/items/ITM272692
BELLETT,M,Immigrant,,CARRIGG A,16,1869/10/01,1869,19,A/13553,ITM272692,DR115625,https://www.archivessearch.qld.gov.au/api/download_file/DR115625,Z317,S7454,Register of Immigrants 1864-1878,Application details for passage certificates for immigration that were registered in Toowoomba; most immigrants in this register originate from Ireland,https://www.archivessearch.qld.gov.au/items/ITM272692
BELLETT,M,Immigrant,,CARRIGG A,16,1869/11/10,1869,19,A/13553,ITM272692,DR115625,https://www.archivessearch.qld.gov.au/api/download_file/DR115625,Z317,S7454,Register of Immigrants 1864-1878,Application details for passage certificates for immigration that were registered in Toowoomba; most immigrants in this register originate from Ireland,https://www.archivessearch.qld.gov.au/items/ITM272692
BENNETT,Anne,Immigrant,,BENNETT John Wm,33,1864/04/14,1864,2,A/13553,ITM272692,DR115625,https://www.archivessearch.qld.gov.au/api/download_file/DR115625,Z317,S7454,Register of Immigrants 1864-1878,Application details for passage certificates for immigration that were registered in Toowoomba; most immigrants in this register originate from Ireland,https://www.archivessearch.qld.gov.au/items/ITM272692
BENNETT,Anne,Immigrant,,BENNETT John Wm,33,1864/05/26,1864,3,A/13553,ITM272692,DR115625,https://www.archivessearch.qld.gov.au/api/download_file/DR115625,Z317,S7454,Register of Immigrants 1864-1878,Application details for passage certificates for immigration that were registered in Toowoomba; most immigrants in this register originate from Ireland,https://www.archivessearch.qld.gov.au/items/ITM272692
BENNETT,Eliza,Immigrant,,BENNETT John Wm,31,1864/04/14,1864,2,A/13553,ITM272692,DR115625,https://www.archivessearch.qld.gov.au/api/download_file/DR115625,Z317,S7454,Register of Immigrants 1864-1878,Application details for passage certificates for immigration that were registered in Toowoomba; most immigrants in this register originate from Ireland,https://www.archivessearch.qld.gov.au/items/ITM272692
BENNETT,Eliza,Immigrant,,BENNETT John Wm,31,1864/05/26,1864,3,A/13553,ITM272692,DR115625,https://www.archivessearch.qld.gov.au/api/download_file/DR115625,Z317,S7454,Register of Immigrants 1864-1878,Application details for passage certificates for immigration that were registered in Toowoomba; most immigrants in this register originate from Ireland,https://www.archivessearch.qld.gov.au/items/ITM272692
BENNETT,Jane,Immigrant,,BENNETT John Wm,34,1864/04/14,1864,2,A/13553,ITM272692,DR115625,https://www.archivessearch.qld.gov.au/api/download_file/DR115625,Z317,S7454,Register of Immigrants 1864-1878,Application details for passage certificates for immigration that were registered in Toowoomba; most immigrants in this register originate from Ireland,https://www.archivessearch.qld.gov.au/items/ITM272692
BENNETT,Jane,Immigrant,,BENNETT John Wm,34,1864/05/26,1864,3,A/13553,ITM272692,DR115625,https://www.archivessearch.qld.gov.au/api/download_file/DR115625,Z317,S7454,Register of Immigrants 1864-1878,Application details for passage certificates for immigration that were registered in Toowoomba; most immigrants in this register originate from Ireland,https://www.archivessearch.qld.gov.au/items/ITM272692
BENNETT,John Wm,Depositor or Applicant,,,,1864/04/14,1864,2,A/13553,ITM272692,DR115625,https://www.archivessearch.qld.gov.au/api/download_file/DR115625,Z317,S7454,Register of Immigrants 1864-1878,Application details for passage certificates for immigration that were registered in Toowoomba; most immigrants in this register originate from Ireland,https://www.archivessearch.qld.gov.au/items/ITM272692
BENNETT,John Wm,Depositor or Applicant,,,,1864/05/26,1864,3,A/13553,ITM272692,DR115625,https://www.archivessearch.qld.gov.au/api/download_file/DR115625,Z317,S7454,Register of Immigrants 1864-1878,Application details for passage certificates for immigration that were registered in Toowoomba; most immigrants in this register originate from Ireland,https://www.archivessearch.qld.gov.au/items/ITM272692
BIEBER,Augusta,Immigrant,,KNANOWSKI Anna,23,1874/11/30,1874,42,A/13553,ITM272692,DR115625,https://www.archivessearch.qld.gov.au/api/download_file/DR115625,Z317,S7454,Register of Immigrants 1864-1878,Application details for passage certificates for immigration that were registered in Toowoomba; most immigrants in this register originate from Ireland,https://www.archivessearch.qld.gov.au/items/ITM272692
BISHOP,William,Depositor or Applicant,,,,1873/09/27,1873,34,A/13553,ITM272692,DR115625,https://www.archivessearch.qld.gov.au/api/download_file/DR115625,Z317,S7454,Register of Immigrants 1864-1878,Application details for passage certificates for immigration that were registered in Toowoomba; most immigrants in this register originate from Ireland,https://www.archivessearch.qld.gov.au/items/ITM272692
BLACK,Samuel,Depositor or Applicant,,,,1878/07/05,1878,51,A/13553,ITM272692,DR115625,https://www.archivessearch.qld.gov.au/api/download_file/DR115625,Z317,S7454,Register of Immigrants 1864-1878,Application details for passage certificates for immigration that were registered in Toowoomba; most immigrants in this register originate from Ireland,https://www.archivessearch.qld.gov.au/items/ITM272692
BLACK,Wm John,Immigrant,,BLACK Samuel,21,1878/07/05,1878,51,A/13553,ITM272692,DR115625,https://www.archivessearch.qld.gov.au/api/download_file/DR115625,Z317,S7454,Register of Immigrants 1864-1878,Application details for passage certificates for immigration that were registered in Toowoomba; most immigrants in this register originate from Ireland,https://www.archivessearch.qld.gov.au/items/ITM272692
BLAIR,Alexander,Depositor or Applicant,,,,1873/08/12,1873,33,A/13553,ITM272692,DR115625,https://www.archivessearch.qld.gov.au/api/download_file/DR115625,Z317,S7454,Register of Immigrants 1864-1878,Application details for passage certificates for immigration that were registered in Toowoomba; most immigrants in this register originate from Ireland,https://www.archivessearch.qld.gov.au/items/ITM272692
BLAIR,James,Immigrant,,BLAIR Alexander,21,1873/08/12,1873,33,A/13553,ITM272692,DR115625,https://www.archivessearch.qld.gov.au/api/download_file/DR115625,Z317,S7454,Register of Immigrants 1864-1878,Application details for passage certificates for immigration that were registered in Toowoomba; most immigrants in this register originate from Ireland,https://www.archivessearch.qld.gov.au/items/ITM272692
BLAKE,Bessie,Immigrant,,BLAKE Thomas,26,1866/04/16,1866,11,A/13553,ITM272692,DR115625,https://www.archivessearch.qld.gov.au/api/download_file/DR115625,Z317,S7454,Register of Immigrants 1864-1878,Application details for passage certificates for immigration that were registered in Toowoomba; most immigrants in this register originate from Ireland,https://www.archivessearch.qld.gov.au/items/ITM272692
BLAKE,Mary,Immigrant,,BLAKE Thomas,20,1866/04/16,1866,11,A/13553,ITM272692,DR115625,https://www.archivessearch.qld.gov.au/api/download_file/DR115625,Z317,S7454,Register of Immigrants 1864-1878,Application details for passage certificates for immigration that were registered in Toowoomba; most immigrants in this register originate from Ireland,https://www.archivessearch.qld.gov.au/items/ITM272692
BLAKE,Thomas,Depositor or Applicant,,,,1866/04/16,1866,11,A/13553,ITM272692,DR115625,https://www.archivessearch.qld.gov.au/api/download_file/DR115625,Z317,S7454,Register of Immigrants 1864-1878,Application details for passage certificates for immigration that were registered in Toowoomba; most immigrants in this register originate from Ireland,https://www.archivessearch.qld.gov.au/items/ITM272692
BLANEY,Henry,Depositor or Applicant,,,,1875/03/29,1875,43,A/13553,ITM272692,DR115625,https://www.archivessearch.qld.gov.au/api/download_file/DR115625,Z317,S7454,Register of Immigrants 1864-1878,Application details for passage certificates for immigration that were registered in Toowoomba; most immigrants in this register originate from Ireland,https://www.archivessearch.qld.gov.au/items/ITM272692
BOHAN,Michl,Depositor or Applicant,,,,1864/10/08,1864,5,A/13553,ITM272692,DR115625,https://www.archivessearch.qld.gov.au/api/download_file/DR115625,Z317,S7454,Register of Immigrants 1864-1878,Application details for passage certificates for immigration that were registered in Toowoomba; most immigrants in this register originate from Ireland,https://www.archivessearch.qld.gov.au/items/ITM272692
BOHAN,Patrick,Immigrant,,BOHAN Michl,16,1864/10/08,1864,5,A/13553,ITM272692,DR115625,https://www.archivessearch.qld.gov.au/api/download_file/DR115625,Z317,S7454,Register of Immigrants 1864-1878,Application details for passage certificates for immigration that were registered in Toowoomba; most immigrants in this register originate from Ireland,https://www.archivessearch.qld.gov.au/items/ITM272692
BOHAN,Rose,Immigrant,,BOHAN Michl,18,1864/10/08,1864,5,A/13553,ITM272692,DR115625,https://www.archivessearch.qld.gov.au/api/download_file/DR115625,Z317,S7454,Register of Immigrants 1864-1878,Application details for passage certificates for immigration that were registered in Toowoomba; most immigrants in this register originate from Ireland,https://www.archivessearch.qld.gov.au/items/ITM272692
BOHANE,Bridget,Immigrant,,MORAHAN Thomas,20,1878/04/29,1878,51,A/13553,ITM272692,DR115625,https://www.archivessearch.qld.gov.au/api/download_file/DR115625,Z317,S7454,Register of Immigrants 1864-1878,Application details for passage certificates for immigration that were registered in Toowoomba; most immigrants in this register originate from Ireland,https://www.archivessearch.qld.gov.au/items/ITM272692