Title,Description,Keywords,Address 1,Address 2,Suburb,State,Postcode,Latitude,Longitude,Phone,Mobile1,Mobile2,Boat,PWC,Website,Area serviced,URL
AG Boat Licensing,,,,179 Palmerin Street,Warwick,Qld,4370,-28.222899,152.030889,,0414 182 182,,Yes,Yes,[AG Boat Licensing website](http://qldboatlicence.com.au/),Southern Queensland,AG Boat Licensing-179 Palmerin Street-Southern Queensland
Albatross Boat Licencing,,,Contact the training provider for address information,,Hervey Bay,Qld,4208,-25.356239,152.912229,,0427 590 400,,Yes,Yes,[Albatross Boat Licencing website](http://www.albatrossboating.com),"Hervey Bay, Bundaberg","Albatross Boat Licencing--Hervey Bay, Bundaberg"
All About Boat and JetSki Licenses,,,,80 Ferry Road,Carbrook,Qld,4130,-27.69075,153.260697,(07) 3287 6262,0418 159 162,,Yes,Yes,[All About Boat and JetSki Licenses website](http://boatlicence.net.au),"South East Queensland, Central Queensland, West End, Jindalee, Bowen, Whitsunday Region","All About Boat and JetSki Licenses-80 Ferry Road-South East Queensland, Central Queensland"
Allstate Boat Licensing and Training (Manly),,,,Trafalgar Street,Manly,Qld,4179,-27.451787,153.189317,(07) 3822 4432,0428 137 579,,Yes,Yes,[Allstate Boat Licensing and Training website](http://www.boatlicensing.com.au),"Brisbane, Bayside, Southside","Allstate Boat Licensing and Training-Trafalgar Street-Brisbane, Bayside, Southside"
Allstate Boat Licensing and Training (Shorncliffe),,,,95 Allpass Parade,Shorncliffe,Qld,4017,-27.331805,153.082085,,0428 981 770,,Yes,Yes,[Allstate Boat Licensing and Training website](http://www.boatlicensing.com.au),"North Brisbane, Bribie Island, Caboolture","Allstate Boat Licensing and Training-95 Allpass Parade-North Brisbane, Bribie Island, Caboolture"
Allstate Boat Licensing and Training (Hope Island),,,,John Lund Dr,Hope Island,Qld,4212,-27.869372,153.374287,(07) 5559 5559,0411 205 970,,Yes,Yes,[Allstate Boat Licensing and Training website](http://www.boatlicensing.com.au),Gold Coast,Allstate Boat Licensing and Training-John Lund Dr-Gold Coast
Allstate Boat Licensing and Training (Warana),,,,264 Nicklin Way,Warana,Qld,4575,-26.727061,153.127844,(07) 5478 1987,0412 161 559,,Yes,Yes,[Allstate Boat Licensing and Training website](http://www.boatlicensing.com.au),Sunshine Coast,Allstate Boat Licensing and Training-264 Nicklin Way-Sunshine Coast
Allstate Boat Licensing and Training (Murgon),,,,40 Murgon-Barambah Road,Murgon,Qld,4605,-26.250038,151.975539,(07) 5478 1987,0412 161 559,,Yes,Yes,[Allstate Boat Licensing and Training website](http://www.boatlicensing.com.au),South Burnett,Allstate Boat Licensing and Training-40 Murgon-Barambah Road-South Burnett
Allstate Boat Licensing and Training (Tin Can Bay),,,,82 Gympie Road,Tin Can Bay,Qld,4580,-25.919185,153.001184,,0418 743 727,,Yes,Yes,[Allstate Boat Licensing and Training website](http://www.boatlicensing.com.au),"Tin Can Bay, Gympie","Allstate Boat Licensing and Training-82 Gympie Road-Tin Can Bay, Gympie"
Allstate Boat Licensing and Training (Avenell Heights),,,,94 Avenell Street,Avenell Heights,Qld,4670,-24.889202,152.37116,,0409 692 695,,Yes,Yes,[Allstate Boat Licensing and Training website](http://www.boatlicensing.com.au),Bundaberg,Allstate Boat Licensing and Training-94 Avenell Street-Bundaberg
Allstate Boat Licensing and Training (Wondunna),,,,Rosewood Avenue,Wondunna,Qld,4655,-25.309195,152.868238,(07) 4125 8175,0409 472 629,,Yes,Yes,[Allstate Boat Licensing and Training website](http://www.boatlicensing.com.au),Hervey Bay,Allstate Boat Licensing and Training-Rosewood Avenue-Hervey Bay
Allstate Boat Licensing and Training (Emerald),,,Contact the training provider for address information,,Emerald,Qld,4720,-23.524135,148.163886,,0488 020 855,,Yes,Yes,[Allstate Boat Licensing and Training website](http://www.boatlicensing.com.au),Central West Queensland,Allstate Boat Licensing and Training-Selma Road-Central West Queensland
Allstate Boat Licensing and Training (Gladstone),,,Contact the training provider for address information,,Gladstone,Qld,4680,-23.861718,151.249389,,0488 020 855,,Yes,Yes,[Allstate Boat Licensing and Training website](http://www.boatlicensing.com.au),Gladstone,Allstate Boat Licensing and Training-7 Dawson Highway-Gladstone
Allstate Boat Licensing and Training (Mackay),,,,9 River Street,Mackay,Qld,4740,-21.141545,149.191002,(07) 4942 1145,0413 049 656,,Yes,Yes,[Allstate Boat Licensing and Training website](http://www.boatlicensing.com.au),Mackay,Allstate Boat Licensing and Training-9 River Street-Mackay
Allstate Boat Licensing and Training (Causeway Lake),,,,Causeway Esplanade,Causeway Lake,Qld,4703,-23.198296,150.787783,,0488 020 855,,Yes,Yes,[Allstate Boat Licensing and Training website](http://www.boatlicensing.com.au),"Rockhampton, Emu Park","Allstate Boat Licensing and Training-Causeway Esplanade-Rockhampton, Emu Park"
Allstate Boat Licensing and Training (Edmonton),,,,21 Millhouse Close,Edmonton,Qld,4869,-17.022042,145.717731,(07) 4045 0539,0419 641 942,,Yes,Yes,[Allstate Boat Licensing and Training website](http://www.boatlicensing.com.au),Cairns and Atherton Tablelands,Allstate Boat Licensing and Training-21 Millhouse Close-Cairns and Atherton Tablelands
Allstate Boat Licensing and Training (Rocky Point),,,,2 Tonkin Road,Rocky Point,Qld,4874,-12.620584,141.887062,(07) 4069 7535,0427 697 535,,Yes,Yes,[Allstate Boat Licensing and Training website](http://www.boatlicensing.com.au),"Innisfail, Gulf region, Weipa, Cape York","Allstate Boat Licensing and Training-2 Tonkin Road-Innisfail, Gulf region"
Allstate Boat Licensing and Training (Logan Village),,,Contact the training provider for address information,,Logan Village,Qld,4207,-27.766068,153.099523,(07) 5547 8826,0403 655 655,,Yes,Yes,[Allstate Boat Licensing and Training website](http://www.boatlicensing.com.au),Logan region,Allstate Boat Licensing and Training--Logan region
Allstate Boat Licensing and Training (Lake Moogerah),,,Contact the training provider for address information,,Lake Moogerah,Qld,4309,-28.044957,152.541453,(07) 5547 8826,0403 655 655,,Yes,Yes,[Allstate Boat Licensing and Training website](http://www.boatlicensing.com.au),Southwest Queensland,Allstate Boat Licensing and Training--Southwest Queensland
Allstate Boat Licensing and Training (Blackwater),,,Contact the training provider for address information,,Blackwater,Qld,4717,-23.507844,148.854558,,0488 020 855,,Yes,Yes,[Allstate Boat Licensing and Training website](http://www.boatlicensing.com.au),Blackwater,
Allstate Boat Licensing and Training (Clermont),,,Contact the training provider for address information,,Clermont,Qld,4721,-22.961461,147.55839,,0488 020 855,,Yes,Yes,[Allstate Boat Licensing and Training website](http://www.boatlicensing.com.au),Clermont,
Allstate Boat Licensing and Training (Biloela),,,Contact the training provider for address information,,Biloela,Qld,4715,-22.961461,147.55839,,0488 020 855,,Yes,Yes,[Allstate Boat Licensing and Training website](http://www.boatlicensing.com.au),"Biloela, Moura",
Allstate Boat Licensing and Training,,,1 Ralston Street,,West End,Qld,4810,-19.2620616,146.7899622,,0419 729 227,,Yes,Yes,[Allstate Boat Licensing and Training website](https://boatlicensing.com.au/home/blog/location/townsville/),Townsville,Allstate Boat Licensing and Training--1-Ralston
Andrew Ryder Boat Licensing (Wulguru),,,,23 Nobel Street,Wulguru,Qld,4811,-19.324774,146.808644,(07) 4778 4070,0487 196 359,,Yes,Yes,[Andrew Ryder Boat Licensing website](http://www.andrewryderboatlicensing.com),"Ayr, Magnetic Island, Townsville",Andrew Ryder Boat Licensing-23 Nobel Street-Townsville
Andrew Ryder Boat Licensing (Magnetic Island),,,,1/40 marine parade Arcadia ,Magnetic Island,Qld,4819,-19.1536733,146.8580841,(07) 4778 4070,0487 196 359,,Yes,Yes,[Andrew Ryder Boat Licensing website](http://www.andrewryderboatlicensing.com),"Ayr, Magnetic Island, Townsville",Andrew Ryder Boat Licensing-23 Nobel Street-Townsville
Andrew Ryder Boat Licensing (Home Hill),,,,15 Seventh Avenue,Home Hill,Qld,4806,-19.6566691,147.4074493,(07) 4778 4070,0487 196 359,,Yes,Yes,[Andrew Ryder Boat Licensing website](http://www.andrewryderboatlicensing.com),"Ayr, Magnetic Island, Townsville, Home Hill",Andrew Ryder Boat Licensing-15-seventh-avenue
Aussie Boating,,,Volunteer Marine Rescue,The Esplanade,Jacobs Well,Qld,4208,-27.782846,153.370812,,0428 729 355,,Yes,Yes,[Aussie Boating website](http://boatandjetski.com.au),Jacobs Well,Aussie Boating-The Esplanade-Jacobs Well
Australian Boat Safe Licence College (Southport),,,,Muriel-Henchman Drive,Southport,Qld,4217,-27.952122,153.424533,(07) 5530 3619,0419 591 370,,Yes,Yes,[Australian Boat Safe Licence College website](http://www.myboat.net.au),South East Queensland,Australian Boat Safe Licence College-Muriel-Henchman Drive-South East Queensland
Australian Boat Safe Licence College (Murrarie),,,,29A / 17 Rivergate Place,Murarrie,Qld,4172,-27.44654,153.105056,(07) 5530 3619,0419 591 370,,Yes,Yes,[Australian Boat Safe Licence College website](http://www.myboat.net.au),South East Queensland,Australian Boat Safe Licence College-29A / 17 Rivergate Place-South East Queensland
Australian Boat Safe Licence College (Jindalee),,,Scouts Hall ,Mt Ommaney Drive,Jindalee,Qld,4074,-27.528836,152.931399,(07) 5530 3619,0419 591 370,,Yes,Yes,[Australian Boat Safe Licence College website](http://www.myboat.net.au),South East Queensland,Australian Boat Safe Licence College-Mt Ommaney Drive-South East Queensland
Australian Boat Safe Licence College (Colmsie boat ramp),,,,Col Gardener Drive,Morningside,Qld,4170,-27.4574537,153.0762683,(07) 5530 3619,0419 591 370,,Yes,Yes,[Australian Boat Safe Licence College website](http://www.myboat.net.au),South East Queensland,Australian Boat Safe Licence College-Colmslie
Australian Boat Safe Licence College (Boat ramp at Cabbage Tree Point Road),,,,Cabbage Tree Point Road,Cabbage Tree Point,Qld,4207,-27.7434832,153.342621,(07) 5530 3619,0419 591 370,,Yes,Yes,[Australian Boat Safe Licence College website](http://www.myboat.net.au),South East Queensland,Australian Boat Safe Licence College-Cabbage Tree Creek Road-South East Queensland
Australian Boat Safe Licence College (Scarborough Boat Ramp),,,,Bird O'Passage Parade ,Scarborough,Qld,4020,-27.1949076,153.1068844,(07) 5530 3619,0419 591 370,,Yes,Yes,[Australian Boat Safe Licence College website](http://www.myboat.net.au),South East Queensland,Australian Boat Safe Licence College-Bird O'Passage Parade-South East Queensland
Australian Boat Safe Licence College (Nudgee Beach Boat Ramp),,,,1512 Nudgee Road,Nudgee Beach,Qld,4014,-27.3642685,153.097974,(07) 5530 3619 ,0419 591 370,,Yes,Yes,[Australian Boat Safe Licence College website](http://www.myboat.net.au),South East Queensland,Australian Boat Safe Licence College-1512 Nudgee Road-South East Queensland
Australian Boat Safe Licence College (Boat ramp at Dohles Rocks Road),,,,Dohles Rocks Road,Griffin,Qld,4503,-27.2656,153.05,(07) 5530 3619,0419 591 370,,Yes,Yes,[Australian Boat Safe Licence College website](http://www.myboat.net.au),South East Queensland,Australian Boat Safe Licence College-Dohles Rock Road-South East Queensland
Australian Boat Safe Licence College (Public Jetty Cleveland),,,,Shore Street,Cleveland,Qld,4165,-27.5233,153.2648,(07) 5530 3619,0419 591 370,,Yes,Yes,[Australian Boat Safe Licence College website](http://www.myboat.net.au),South East Queensland,Australian Boat Safe Licence College-Shore-Street
Australian Boating College (Airlie Beach),,,Whitsunday Sailing Club,Airlie Point,Airlie Beach,Qld,4802,-20.266844,148.722769,(07) 4946 6138,,,Yes,Yes,[Australian Boating College website](http://www.abcboating.com),Airlie Beach,Australian Boating College-Airlie Point-Airlie Beach
Australian Boating College (Caloundra),,,,8 Baldwin Street,Caloundra,Qld,4551,-26.804259,153.119359,,0427 110 025,,Yes,Yes,[Australian Boating College website](http://www.abcboating.com),"Maroochydore, Caloundra, Noosa","Australian Boating College-8 Baldwin Street-Maroochydore, Caloundra, Noosa"
Australian Boating College (Diddillibah),,,,David Low Way,Diddillibah,Qld,4559,-26.642025,153.049823,,0427 110 025,,Yes,Yes,[Australian Boating College website](http://www.abcboating.com),Maroochydore,Australian Boating College-David Low Way-Maroochydore
Australian Boating College (Main Beach),,,,1 Macarthur Parade,Main Beach,Qld,4127,-27.974186,153.426355,(07) 5594 5653,,,Yes,Yes,[Australian Boating College website](http://www.abcboating.com),Gold Coast,Australian Boating College-1 Macarthur Parade-Gold Coast
Australian Boating College (Woongoolba),,,,Cabbage Tree Point Road,Woongoolba,Qld,4270,-27.752122,153.345879,(07) 5594 5653,,,Yes,Yes,[Australian Boating College website](http://www.abcboating.com),Jacobs Well,Australian Boating College-Cabbage Tree Point Road-Jacobs Well
Australian Boating College (Tewantin),,,,65 Hilton Terrace,Tewantin,Qld,4558,-26.398461,153.048992,,0427 110 025,,Yes,Yes,[Australian Boating College website](http://www.abcboating.com),Noosa,Australian Boating College-65 Hilton Terrace-Noosa
Australian Boating College (Cleveland),,,Contact the training provider for address information,,Cleveland,Qld,4163,-27.514635,153.28813,1300 934 440,,,Yes,Yes,[Australian Boating College website](http://www.abcboating.com),Cleveland,Australian Boating College--Cleveland
Australian Boating College (East Brisbane),,,Contact the training provider for address information,,East Brisbane,Qld,4169,-27.478457,153.043575,1300 934 440,,,Yes,Yes,[Australian Boating College website](http://www.abcboating.com),East Brisbane,Australian Boating College--East Brisbane
Australian Boating College (Karana Downs),,,Contact the training provider for address information,,Karana Downs,Qld,4306,-27.542964,152.840552,1300 934 440,,,Yes,Yes,[Australian Boating College website](http://www.abcboating.com),Karana Downs,Australian Boating College--Karana Downs
Australian Boating College (Scarborough),,,Contact the training provider for address information,,Scarborough,Qld,4020,-27.195639,153.105442,1300 934 440,,,Yes,Yes,[Australian Boating College website](http://www.abcboating.com),Scarborough,Australian Boating College--Scarborough
Australian Boating College (Redcliffe),,,Contact the training provider for address information,,Redcliffe,Qld,4020,-27.257384,153.089074,1300 934 440,,,Yes,Yes,[Australian Boating College website](http://www.abcboating.com),Redcliffe,Australian Boating College--Redcliffe
Australian Boating College (Bribie Island),,,Contact the training provider for address information,,Bribie Island,Qld,4507,-27.071726,153.154731,1300 934 440,,,Yes,Yes,[Australian Boating College website](http://www.abcboating.com),Bribie Island,Australian Boating College--Bribie Island
Australian Boating College (Manly),,,Contact the training provider for address information,,Manly,Qld,4179,-27.453084,153.188553,1300 934 440,,,Yes,Yes,[Australian Boating College website](http://www.abcboating.com),Manly,Australian Boating College--Manly
Australian Boating College (Bundaberg),,,Contact the training provider for address information,,Bundaberg,Qld,4670,-24.865851,152.342503,(07) 4159 5448,0427 547 089,,Yes,Yes,[Australian Boating College website](http://www.abcboating.com),Bundaberg,Australian Boating College--Bundaberg
Australian Boating College (Cairns),,,Contact the training provider for address information,,Cairns,Qld,4870,-16.921032,145.769802,,0416 099 479,0422 224 404,Yes,Yes,[Australian Boating College website](http://www.abcboating.com),"Cairns, Atherton Tablelands, Cape York","Australian Boating College--Cairns, Atherton Tablelands, Cape York"
Australian Boating College (Hervey Bay),,,Contact the training provider for address information,,Hervey Bay,Qld,4655,-25.333807,152.874844,(07) 4125 5528,,,Yes,Yes,[Australian Boating College website](http://www.abcboating.com),Hervey Bay,Australian Boating College--Hervey Bay
Australian Boating College (Mackay),,,Contact the training provider for address information,,Mackay,Qld,4740,-21.141357,149.186769,,0416 099 479,0422 224 404,Yes,Yes,[Australian Boating College website](http://www.abcboating.com),Mackay,Australian Boating College--Mackay
Australian Boating College (Mt Isa),,,Contact the training provider for address information,,Mt Isa,Qld,4825,-20.724395,139.489497,,0416 099 479,0422 224 404,Yes,Yes,[Australian Boating College website](http://www.abcboating.com),"Mt Isa, Gulf regions","Australian Boating College--Mt Isa, Gulf regions"
Australian Boating College (Townsville),,,Contact the training provider for address information,,Townsville,Qld,4810,-19.2526,146.819596,,0416 099 479,0422 224 404,Yes,Yes,[Australian Boating College website](http://www.abcboating.com),Townsville,Australian Boating College--Townsville
Australian Boating College (Weipa),,,Contact the training provider for address information,,Weipa,Qld,4874,-12.6167,141.8667,,0416 099 479,0422 224 404,Yes,Yes,[Australian Boating College website](http://www.abcboating.com),Weipa,Australian Boating College--Weipa
Australian Boating College (Kirwan),,,Contact the training provider for address information,,Kirwan,Qld,4817,-19.3103,146.7286,,0416 099 479,0422 224 404,Yes,Yes,[Australian Boating College website](http://www.abcboating.com),Kirwan,Australian Boating College--Kirwan
Australian Boating College (Magnetic Island),,,Contact the training provider for address information,,Magnetic Island,Qld,4819,-19.1333,146.8333,,0416 099 479,0422 224 404,Yes,Yes,[Australian Boating College website](http://www.abcboating.com),Magnetic Island,Australian Boating College--Magnetic Island
Australian Boating College (Mt Isa),,,Contact the training provider for address information,,Mt Isa,Qld,4825,-20.7333,139.5,,0416 099 479,0422 224 404,Yes,Yes,[Australian Boating College website](http://www.abcboating.com),Mt Isa,Australian Boating College--Mt Isa
Australian Boating College (Richmond),,,Contact the training provider for address information,,Richmond,Qld,4822,-20.7306,143.1422,,0416 099 479,0422 224 404,Yes,Yes,[Australian Boating College website](http://www.abcboating.com),Richmond,Australian Boating College--Richmond
Australian Boating College (Ingham),,,Contact the training provider for address information,,Ingham,Qld,4850,-18.65,146.1667,,0416 099 479,0422 224 404,Yes,Yes,[Australian Boating College website](http://www.abcboating.com),Ingham,Australian Boating College--Ingham
Australian Boating College (Innisfail),,,Contact the training provider for address information,,Innisfail,Qld,4860,-17.5236,146.0292,,0416 099 479,0422 224 404,Yes,Yes,[Australian Boating College website](http://www.abcboating.com),Innisfail,Australian Boating College--Innisfail
Australian Boating College (Cardwell),,,Contact the training provider for address information,,Cardwell,Qld,4849,-18.2667,146.0333,,0416 099 479,0422 224 404,Yes,Yes,[Australian Boating College website](http://www.abcboating.com),Cardwell,Australian Boating College--Cardwell
Australian Boating College (Normanton),,,Contact the training provider for address information,,Normanton,Qld,4890,-17.6667,141.0667,,0416 099 479,0422 224 404,Yes,Yes,[Australian Boating College website](http://www.abcboating.com),Normanton,Australian Boating College--Normanton
Australian Boating College (Moranbah),,,Contact the training provider for address information,,Moranbah (Lake Elphinstone),Qld,4744,-21.5333,148.2333,,0416 099 479,0422 224 404,Yes,Yes,[Australian Boating College website](http://www.abcboating.com),Moranbah (Lake Elphinstone),Australian Boating College--Moranbah (Lake Elphinstone)
Australian Boating College (Karumba),,,Contact the training provider for address information,,Karumba,Qld,4981,-17.4833,140.8333,,0416 099 479,0422 224 404,Yes,Yes,[Australian Boating College website](http://www.abcboating.com),Karumba,Australian Boating College--Karumba
Australian Boating College (Cooktown),,,Contact the training provider for address information,,Cooktown,Qld,4895,-15.4667,145.2833,,0416 099 479,0422 224 404,Yes,Yes,[Australian Boating College website](http://www.abcboating.com),Cooktown,Australian Boating College--Cooktown
Australian Boating College (Ayr),,,Contact the training provider for address information,,Ayr,Qld,4807,-19.5833,147.4,,0416 099 479,0422 224 404,Yes,Yes,[Australian Boating College website](http://www.abcboating.com),Ayr,Australian Boating College--Ayr
Bay Marine Training,,,,24A Maryborough Terrace,Scarborough,Qld,4020,-27.2122392,153.108124,,0429 066 222,,Yes,Yes,,Queensland,Dancingdrum Pty Ltd-24A Maryborough Terrace Scarborough-Queensland
Bayside Boat Licensing (Victoria Point),,,Volunteer Marine Rescue,Masters Avenue,Victoria Point,Qld,4163,-27.58179,153.317809,1800 802 854,0434 148 705,,Yes,Yes,[Bayside Boat Licensing website](http://www.baysideboatlicensing.com.au),"Victoria Point, Redland Bay","Bayside Boat Licensing-Masters Avenue-Victoria Point, Redland Bay"
Boating4Life,,,,Contact the training provider for address information,Mooloolaba,Qld,4557,-26.6851157,153.1074873,,0457 777 914,,Yes,Yes,[Boating4Life](https://boating4life.com.au/),Sunshine Coast,Boating4Life-Mooloolaba
Boat Jetski Licence,,,Various locations,Contact the training provider for address information,,,,-27.1202632,152.5046836,1300 695 423,,,Yes,Yes,[Boat Jetski Licence website](http://boatjetskilicence.com),"Clontarf, Redcliffe, Bribie Island, Caboolture, Ipswich, Jindalee, Colmslie, Wynnum, Victoria Point, Raby Bay, Logan, Coomera, Jacobs Well, Runaway Bay, Holleywell, Southport, The Spit, Broadbeach, Carrara, Burleigh Heads, Reedy Creek, Palm Beach, Currumbin, Tweed Heads, Somerset Dam, Atkinson Dam",Boat Jetski Licence-Somerset Dam
Boat Jetski Licence,,,Various locations,Contact the training provider for address information,,,,-27.8487215,153.3264157,1300 695 423,,,Yes,Yes,[Boat Jetski Licence website](http://boatjetskilicence.com),"Clontarf, Redcliffe, Bribie Island, Caboolture, Ipswich, Jindalee, Colmslie, Wynnum, Victoria Point, Raby Bay, Logan, Coomera, Jacobs Well, Runaway Bay, Holleywell, Southport, The Spit, Broadbeach, Carrara, Burleigh Heads, Reedy Creek, Palm Beach, Currumbin, Tweed Heads, Somerset Dam, Atkinson Dam",Boat Jetski Licence-Coomera
Boat Jetski Licence,,,Various locations,Contact the training provider for address information,,,,-27.5822913,153.2724422,1300 695 423,,,Yes,Yes,[Boat Jetski Licence website](http://boatjetskilicence.com),"Clontarf, Redcliffe, Bribie Island, Caboolture, Ipswich, Jindalee, Colmslie, Wynnum, Victoria Point, Raby Bay, Logan, Coomera, Jacobs Well, Runaway Bay, Holleywell, Southport, The Spit, Broadbeach, Carrara, Burleigh Heads, Reedy Creek, Palm Beach, Currumbin, Tweed Heads, Somerset Dam, Atkinson Dam",Boat Jetski Licence-Victoria Point
Boat Jetski Licence,,,Various locations,Contact the training provider for address information,,,,-27.4655758,153.0765471,1300 695 423,,,Yes,Yes,[Boat Jetski Licence website](http://boatjetskilicence.com),"Clontarf, Redcliffe, Bribie Island, Caboolture, Ipswich, Jindalee, Colmslie, Wynnum, Victoria Point, Raby Bay, Logan, Coomera, Jacobs Well, Runaway Bay, Holleywell, Southport, The Spit, Broadbeach, Carrara, Burleigh Heads, Reedy Creek, Palm Beach, Currumbin, Tweed Heads, Somerset Dam, Atkinson Dam",Boat Jetski Licence-Colmslie
Boat Jetski Licence,,,Various locations,Contact the training provider for address information,,,,-27.5354398,152.9298112,1300 695 423,,,Yes,Yes,[Boat Jetski Licence website](http://boatjetskilicence.com),"Clontarf, Redcliffe, Bribie Island, Caboolture, Ipswich, Jindalee, Colmslie, Wynnum, Victoria Point, Raby Bay, Logan, Coomera, Jacobs Well, Runaway Bay, Holleywell, Southport, The Spit, Broadbeach, Carrara, Burleigh Heads, Reedy Creek, Palm Beach, Currumbin, Tweed Heads, Somerset Dam, Atkinson Dam",Boat Jetski Licence-Jindalee